Howdy, Stranger!

It looks like you're new here. If you want to get involved, click one of these buttons!

Having Droiddoc errors while compiling rom

I am facing problem with Droiddoc while compiling rom.
 It is giving me following errors,
[code]
[100% 13/13] Copying test-current.txt
Copying test-removed.txt
[100% 13/13] Docs droiddoc: /home...get/common/docs/doc-comment-check
FAILED: /bin/bash /home/nit_in/rr/out/target/common/docs/doc-comment-check-timestamp.rsp
frameworks/base/core/java/android/app/ThemeManager.java:47: error 103: Unknown tag: @Override
frameworks/base/core/java/android/app/ThemeManager.java:54: error 103: Unknown tag: @Override
frameworks/base/core/java/android/app/ThemeManager.java:65: error 103: Unknown tag: @Override
frameworks/base/core/java/android/app/ThemeManager.java:79: error 103: Unknown tag: @Override
frameworks/base/core/java/android/pocket/PocketManager.java:36: error 103: Unknown tag: @Override
frameworks/base/core/java/android/provider/Settings.java:3672: error 101: Unresolved link/see tag "android.provider.Settings.Global.KEY_SMS_BREATH" in android.provider.Settings.System
frameworks/base/core/java/android/widget/SeekBar.java:41: error 101: Unresolved link/see tag "ProgressBar.setMax(int)" in android.preference.CustomSeekBarPreference
frameworks/base/core/java/android/widget/SeekBar.java:43: error 101: Unresolved link/see tag "ProgressBar.setMax(int)" in android.widget.SeekBar.OnSeekBarChangeListener
DroidDoc took 292 sec. to write docs to /home/nit_in/rr/out/target/common/docs/doc-comment-check
ninja: build stopped: subcommand failed.
build/core/ninja.mk:151: recipe for target 'ninja_wrapper' failed
make: *** [ninja_wrapper] Error 1
[/code]




 I tried to fix them but nothing seem to work. Kindly help Thanks
Tagged:
Sign In or Register to comment.